Target
Glutamate receptor ionotropic, NMDA 1
Ligand
BDBM50052630
Substrate
Meas. Tech.
ChEMBL_140403 (CHEMBL746729)
IC50
730±n/a nM
Citation
 Cai, SXZhou, ZLHuang, JCWhittemore, EREgbuwoku, ZOLü, YHawkinson, JEWoodward, RMWeber, EKeana, JF Synthesis and structure-activity relationships of 1,2,3,4-tetrahydroquinoline-2,3,4-trione 3-oximes: novel and highly potent antagonists for NMDA receptor glycine site. J Med Chem 39:3248-55 (1996)  
Target
Name:
Glutamate receptor ionotropic, NMDA 1
Synonyms:
Glutamate (NMDA) receptor subunit zeta 1 Glutamate-NMDA-Channel Glutamate-NMDA-Polyamine NMDA Nmdar1 | phencyclidine
Type:
Enzyme Catalytic Domain
Mol. Mass.:
105533.40
Organism:
RAT
Description:
P35439
Residue:
938
  
Inhibitor
Name:
BDBM50052630
Synonyms:
5,6,7,8-Tetrafluoro-1,4-dihydro-quinoxaline-2,3-dione | CHEMBL289779
Type:
Small organic molecule
Emp. Form.:
C8H2F4N2O2
Mol. Mass.:
234.1073
SMILES:
Fc1c(F)c(F)c2[nH]c(=O)c(=O)[nH]c2c1F
: