Target
Low-density lipoprotein receptor
Ligand
BDBM50052677
Substrate
Meas. Tech.
ChEMBL_99545 (CHEMBL707778)
EC50
2000±n/a nM
Citation
 Ashton, MJBrown, TJFenton, GHalley, FHarper, MFLockey, PMPorter, BRoach, AGStuttle, KAVicker, NWalsh, RJ New low-density lipoprotein receptor upregulators acting via a novel mechanism. J Med Chem 39:3343-56 (1996)  
Target
Name:
Low-density lipoprotein receptor
Synonyms:
LDL receptor LDLR_HUMAN | Low-density lipoprotein receptor
Type:
PROTEIN
Mol. Mass.:
95343.42
Organism:
Homo sapiens (Human)
Description:
ChEMBL_99545
Residue:
860
  
Inhibitor
Name:
BDBM50052677
Synonyms:
CHEMBL115779 | N-(2-Cyclohexyl-ethyl)-3-(4-hydroxy-benzoylamino)-4-methyl-benzamide
Type:
Small organic molecule
Emp. Form.:
C23H28N2O3
Mol. Mass.:
380.48
SMILES:
Cc1ccc(cc1NC(=O)c1ccc(O)cc1)C(=O)NCCC1CCCCC1
: