Target
Low-density lipoprotein receptor
Ligand
BDBM50052691
Substrate
Meas. Tech.
ChEMBL_99546 (CHEMBL707779)
EC50
2000±n/a nM
Citation
 Ashton, MJBrown, TJFenton, GHalley, FHarper, MFLockey, PMPorter, BRoach, AGStuttle, KAVicker, NWalsh, RJ New low-density lipoprotein receptor upregulators acting via a novel mechanism. J Med Chem 39:3343-56 (1996)  
Target
Name:
Low-density lipoprotein receptor
Synonyms:
LDL receptor LDLR_HUMAN | Low-density lipoprotein receptor
Type:
PROTEIN
Mol. Mass.:
95343.42
Organism:
Homo sapiens (Human)
Description:
ChEMBL_99545
Residue:
860
  
Inhibitor
Name:
BDBM50052691
Synonyms:
CHEMBL114199 | N-[5-(4-Cyclohexyl-butyryl)-2-methyl-phenyl]-nicotinamide
Type:
Small organic molecule
Emp. Form.:
C23H28N2O2
Mol. Mass.:
364.4806
SMILES:
Cc1ccc(cc1NC(=O)c1cccnc1)C(=O)CCCC1CCCCC1
: