Target
Retinoic acid receptor RXR-beta
Ligand
BDBM50052959
Substrate
Meas. Tech.
ChEMBL_197068 (CHEMBL806657)
Kd
10000±n/a nM
Citation
 Beard, RLColon, DFSong, TKDavies, PJKochhar, DMChandraratna, RA Synthesis and structure-activity relationships of retinoid X receptor selective diaryl sulfide analogs of retinoic acid. J Med Chem 39:3556-63 (1996)  
Target
Name:
Retinoic acid receptor RXR-beta
Synonyms:
Nr2b2 Retinoid X receptor beta | Rxrb
Type:
PROTEIN
Mol. Mass.:
55877.78
Organism:
Mus musculus
Description:
ChEMBL_196588
Residue:
520
  
Inhibitor
Name:
BDBM50052959
Synonyms:
4-(3,5,5,8,8-Pentamethyl-5,6,7,8-tetrahydro-naphthalene-2-sulfinyl)-benzoic acid | CHEMBL324960
Type:
Small organic molecule
Emp. Form.:
C22H26O3S
Mol. Mass.:
370.505
SMILES:
Cc1cc2c(cc1S(=O)c1ccc(cc1)C(O)=O)C(C)(C)CCC2(C)C
: