Target
ATP-citrate synthase
Ligand
BDBM50052984
Substrate
Meas. Tech.
ChEMBL_29504 (CHEMBL642005)
Ki
300000±n/a nM
Citation
 Gribble, ADDolle, REShaw, AMcNair, DNovelli, RNovelli, CESlingsby, BPShah, VPTew, DSaxty, BAAllen, MGroot, PHPearce, NYates, J ATP-citrate lyase as a target for hypolipidemic intervention. Design and synthesis of 2-substituted butanedioic acids as novel, potent inhibitors of the enzyme. J Med Chem 39:3569-84 (1996)  
Target
Name:
ATP-citrate synthase
Synonyms:
ACLY | ACLY_HUMAN
Type:
PROTEIN
Mol. Mass.:
120848.43
Organism:
Homo sapiens (Human)
Description:
ChEMBL_455196
Residue:
1101
  
Inhibitor
Name:
BDBM50052984
Synonyms:
2-Hydroxy-2-(3-naphthalen-2-yl-propylsulfanylmethyl)-succinic acid | CHEMBL118897
Type:
Small organic molecule
Emp. Form.:
C18H20O5S
Mol. Mass.:
348.413
SMILES:
OC(=O)CC(O)(CSCCCc1ccc2ccccc2c1)C(O)=O
: