Target
Glutamate receptor ionotropic, kainate 2
Ligand
BDBM50053062
Substrate
Meas. Tech.
ChEMBL_90456 (CHEMBL699991)
Ki
169.3±n/a nM
Citation
 Cantrell, BEZimmerman, DMMonn, JAKamboj, RKHoo, KHTizzano, JPPullar, IAFarrell, LNBleakman, D Synthesis of a series of aryl kainic acid analogs and evaluation in cells stably expressing the kainate receptor humGluR6. J Med Chem 39:3617-24 (1996)  
Target
Name:
Glutamate receptor ionotropic, kainate 2
Synonyms:
EAA4 GLUR6 GRIK2_HUMAN GluR-6 Glutamate receptor 6 Glutamate receptor, ionotropic kainate 2 Glutamate-Kainate, GluR6
Type:
Enzyme Catalytic Domain
Mol. Mass.:
102592.78
Organism:
Homo sapiens (Human)
Description:
Q13002
Residue:
908
  
Inhibitor
Name:
BDBM50053062
Synonyms:
(2S,3S,4S)-3-Carboxymethyl-4-[1-(3,5-dimethyl-phenyl)-vinyl]-pyrrolidine-2-carboxylic acid | CHEMBL121461
Type:
Small organic molecule
Emp. Form.:
C17H21NO4
Mol. Mass.:
303.3529
SMILES:
Cc1cc(C)cc(c1)C(=C)[C@H]1CN[C@@H]([C@H]1CC(O)=O)C(O)=O
: