Target
Glutamate receptor ionotropic, kainate 2
Ligand
BDBM50053070
Substrate
Meas. Tech.
ChEMBL_90595 (CHEMBL701552)
Ki
9±n/a nM
Citation
 Cantrell, BEZimmerman, DMMonn, JAKamboj, RKHoo, KHTizzano, JPPullar, IAFarrell, LNBleakman, D Synthesis of a series of aryl kainic acid analogs and evaluation in cells stably expressing the kainate receptor humGluR6. J Med Chem 39:3617-24 (1996)  
Target
Name:
Glutamate receptor ionotropic, kainate 2
Synonyms:
GRIK2_RAT Glutamate receptor ionotropic kainate 2 Ionotropic glutamate receptor kainate 2/5
Type:
PROTEIN
Mol. Mass.:
102478.61
Organism:
Rattus norvegicus
Description:
ChEMBL_936439
Residue:
908
  
Inhibitor
Name:
BDBM50053070
Synonyms:
(2S,3S,4S)-3-Carboxymethyl-4-{1-[4-(1-methylene-propyl)-phenyl]-vinyl}-pyrrolidine-2-carboxylic acid | CHEMBL118502
Type:
Small organic molecule
Emp. Form.:
C19H23NO4
Mol. Mass.:
329.3902
SMILES:
CCC(=C)c1ccc(cc1)C(=C)[C@H]1CN[C@@H]([C@H]1CC(O)=O)C(O)=O
: