Target
Glutamate receptor ionotropic, kainate 2
Ligand
BDBM50053077
Substrate
Meas. Tech.
ChEMBL_90456 (CHEMBL699991)
Ki
667±n/a nM
Citation
 Cantrell, BEZimmerman, DMMonn, JAKamboj, RKHoo, KHTizzano, JPPullar, IAFarrell, LNBleakman, D Synthesis of a series of aryl kainic acid analogs and evaluation in cells stably expressing the kainate receptor humGluR6. J Med Chem 39:3617-24 (1996)  
Target
Name:
Glutamate receptor ionotropic, kainate 2
Synonyms:
EAA4 GLUR6 GRIK2_HUMAN GluR-6 Glutamate receptor 6 Glutamate receptor, ionotropic kainate 2 Glutamate-Kainate, GluR6
Type:
Enzyme Catalytic Domain
Mol. Mass.:
102592.78
Organism:
Homo sapiens (Human)
Description:
Q13002
Residue:
908
  
Inhibitor
Name:
BDBM50053077
Synonyms:
(2S,3S,4S)-3-Carboxymethyl-4-[1-(3-phenethyloxy-phenyl)-vinyl]-pyrrolidine-2-carboxylic acid | CHEMBL334024
Type:
Small organic molecule
Emp. Form.:
C23H25NO5
Mol. Mass.:
395.4483
SMILES:
OC(=O)C[C@H]1[C@H](CN[C@@H]1C(O)=O)C(=C)c1cccc(OCCc2ccccc2)c1
: