Target
Phospholipase A2
Ligand
BDBM50053095
Substrate
Meas. Tech.
ChEMBL_156183 (CHEMBL760952)
IC50
17±n/a nM
Citation
 Hagishita, SYamada, MShirahase, KOkada, TMurakami, YIto, YMatsuura, TWada, MKato, TUeno, MChikazawa, YYamada, KOno, TTeshirogi, IOhtani, M Potent inhibitors of secretory phospholipase A2: synthesis and inhibitory activities of indolizine and indene derivatives. J Med Chem 39:3636-58 (1996)  
Target
Name:
Phospholipase A2
Synonyms:
Group IB phospholipase A2 PLA2 PLA2G1B Phosphatidylcholine 2-acylhydrolase 1B Phospholipase A2 group 1B | phospholipase A2 precursor
Type:
Protein
Mol. Mass.:
16364.13
Organism:
Homo sapiens (Human)
Description:
P04054
Residue:
148
  
Inhibitor
Name:
BDBM50053095
Synonyms:
(1-Aminooxalyl-2-ethyl-3-naphthalen-2-ylmethyl-indolizin-8-yloxy)-acetic acid | CHEMBL121422
Type:
Small organic molecule
Emp. Form.:
C25H22N2O5
Mol. Mass.:
430.4526
SMILES:
CCc1c(Cc2ccc3ccccc3c2)n2cccc(OCC(O)=O)c2c1C(=O)C(N)=O
: