Target
Alpha-1A adrenergic receptor
Ligand
BDBM50053200
Substrate
Meas. Tech.
ChEMBL_33158 (CHEMBL642943)
IC50
14±n/a nM
Citation
 Andersen, KLiljefors, THyttel, JPerregaard, J Serotonin 5-HT2 receptor, dopamine D2 receptor, and alpha 1 adrenoceptor antagonists. Conformationally flexible analogues of the atypical antipsychotic sertindole. J Med Chem 39:3723-38 (1996)  
Target
Name:
Alpha-1A adrenergic receptor
Synonyms:
ADA1A_RAT Adra1c Alpha-1A adrenoceptor Alpha-1C adrenergic receptor | adrenergic Alpha1A
Type:
Protein
Mol. Mass.:
51620.15
Organism:
Rattus norvegicus (Rat)
Description:
P43140
Residue:
466
  
Inhibitor
Name:
BDBM50053200
Synonyms:
1-[2-({2-[6-Chloro-1-(4-fluoro-phenyl)-1H-indol-3-yl]-ethyl}-methyl-amino)-ethyl]-imidazolidin-2-one | CHEMBL122269
Type:
Small organic molecule
Emp. Form.:
C22H24ClFN4O
Mol. Mass.:
414.904
SMILES:
CN(CCN1CCNC1=O)CCc1cn(-c2ccc(F)cc2)c2cc(Cl)ccc12
: