Target
Cannabinoid receptor 2
Ligand
BDBM50454328
Substrate
Meas. Tech.
ChEMBL_46976 (CHEMBL658878)
Ki
2.9±n/a nM
Citation
 Huffman, JWYu, SShowalter, VAbood, MEWiley, JLCompton, DRMartin, BRBramblett, RDReggio, PH Synthesis and pharmacology of a very potent cannabinoid lacking a phenolic hydroxyl with high affinity for the CB2 receptor. J Med Chem 39:3875-7 (1996)  
Target
Name:
Cannabinoid receptor 2
Synonyms:
CANNABINOID CB2 CB2 CB2B CNR2_HUMAN Cannabinoid CB2 receptor Cannabinoid receptor 2 (CB2R) | hCB2
Type:
G Protein-Coupled Receptor (GPCR)
Mol. Mass.:
39690.94
Organism:
Homo sapiens (Human)
Description:
P34972
Residue:
360
  
Inhibitor
Name:
BDBM50454328
Synonyms:
CHEMBL2112646
Type:
Small organic molecule
Emp. Form.:
C25H38O
Mol. Mass.:
354.5686
SMILES:
[H][C@@]12CC(C)=CC[C@@]1([H])C(C)(C)Oc1cc(CCCCCC(C)(C)C)ccc21
: