Target
Cannabinoid receptor 1
Ligand
BDBM50454328
Substrate
Meas. Tech.
ChEMBL_46633 (CHEMBL658889)
Ki
23±n/a nM
Citation
 Huffman, JWYu, SShowalter, VAbood, MEWiley, JLCompton, DRMartin, BRBramblett, RDReggio, PH Synthesis and pharmacology of a very potent cannabinoid lacking a phenolic hydroxyl with high affinity for the CB2 receptor. J Med Chem 39:3875-7 (1996)  
Target
Name:
Cannabinoid receptor 1
Synonyms:
Brain-type cannabinoid receptor CB-R CNR1_RAT Cannabinoid receptor Cnr1 | Skr6
Type:
G Protein-Coupled Receptor (GPCR)
Mol. Mass.:
52856.55
Organism:
Rattus norvegicus (rat)
Description:
P20272
Residue:
473
  
Inhibitor
Name:
BDBM50454328
Synonyms:
CHEMBL2112646
Type:
Small organic molecule
Emp. Form.:
C25H38O
Mol. Mass.:
354.5686
SMILES:
[H][C@@]12CC(C)=CC[C@@]1([H])C(C)(C)Oc1cc(CCCCCC(C)(C)C)ccc21
: