Target
Cannabinoid receptor 2
Ligand
BDBM50053357
Substrate
Meas. Tech.
ChEMBL_46976 (CHEMBL658878)
Ki
0.52±n/a nM
Citation
 Huffman, JWYu, SShowalter, VAbood, MEWiley, JLCompton, DRMartin, BRBramblett, RDReggio, PH Synthesis and pharmacology of a very potent cannabinoid lacking a phenolic hydroxyl with high affinity for the CB2 receptor. J Med Chem 39:3875-7 (1996)  
Target
Name:
Cannabinoid receptor 2
Synonyms:
CANNABINOID CB2 CB2 CB2B CNR2_HUMAN Cannabinoid CB2 receptor Cannabinoid receptor 2 (CB2R) | hCB2
Type:
G Protein-Coupled Receptor (GPCR)
Mol. Mass.:
39690.94
Organism:
Homo sapiens (Human)
Description:
P34972
Residue:
360
  
Inhibitor
Name:
BDBM50053357
Synonyms:
(6aR,10aR)-9-Hydroxymethyl-6,6-dimethyl-3-nonyl-6a,7,10,10a-tetrahydro-6H-benzo[c]chromen-1-ol | CHEMBL338484
Type:
Small organic molecule
Emp. Form.:
C25H38O3
Mol. Mass.:
386.5674
SMILES:
CCCCCCCCCc1cc(O)c2[C@@H]3CC(CO)=CC[C@H]3C(C)(C)Oc2c1
: