Target
Glutaminase kidney isoform, mitochondrial
Ligand
BDBM50400050
Substrate
Meas. Tech.
ChEMBL_1809965 (CHEMBL4309425)
IC50
100±n/a nM
Citation
 Zimmermann, SCDuvall, BTsukamoto, T Recent Progress in the Discovery of Allosteric Inhibitors of Kidney-Type Glutaminase. J Med Chem 62:46-59 (2019)  
Target
Name:
Glutaminase kidney isoform, mitochondrial
Synonyms:
GLS GLSK_HUMAN K-glutaminase L-glutamine amidohydrolase
Type:
Protein
Mol. Mass.:
73471.89
Organism:
Homo sapiens (Human)
Description:
O94925
Residue:
669
  
Inhibitor
Name:
BDBM50400050
Synonyms:
CHEMBL2177757 US11191732, Example BPTES US9938267, Cmpd ID 1
Type:
Small organic molecule
Emp. Form.:
C24H24N6O2S3
Mol. Mass.:
524.681
SMILES:
O=C(Cc1ccccc1)Nc1nnc(CCSCCc2nnc(NC(=O)Cc3ccccc3)s2)s1
: