Target
Glutaminase kidney isoform, mitochondrial
Ligand
BDBM278471
Substrate
Meas. Tech.
ChEMBL_1809975 (CHEMBL4309435)
IC50
53±n/a nM
Citation
 Zimmermann, SCDuvall, BTsukamoto, T Recent Progress in the Discovery of Allosteric Inhibitors of Kidney-Type Glutaminase. J Med Chem 62:46-59 (2019)  
Target
Name:
Glutaminase kidney isoform, mitochondrial
Synonyms:
GLS GLSK_HUMAN K-glutaminase L-glutamine amidohydrolase
Type:
Protein
Mol. Mass.:
73471.89
Organism:
Homo sapiens (Human)
Description:
O94925
Residue:
669
  
Inhibitor
Name:
BDBM278471
Synonyms:
(1S)-2-methyl-N-[5-[[(3R)-1-pyridazin-3-ylpyrrolidin-3-yl]amino]-1,3,4-thiadiazol-2-yl]-3,4-dihydro-1H-isoquinoline-1-carboxamide and (1R)-2-methyl-N-[5-[[(3R)-1-pyridazin-3-ylpyrrolidin-3-yl]amino]-1,3,4-thiadiazol-2-yl]-3,4-dihydro-1H-isoquinoline-1-carboxamide US10040789, Example 8(b)
Type:
Small organic molecule
Emp. Form.:
C21H24N8OS
Mol. Mass.:
436.533
SMILES:
CN1CCc2ccccc2[C@H]1C(=O)Nc1nnc(N[C@@H]2CCN(C2)c2cccnn2)s1
: