Target
Glutaminase kidney isoform, mitochondrial
Ligand
BDBM404693
Substrate
Meas. Tech.
ChEMBL_1809969 (CHEMBL4309429)
IC50
<100±n/a nM
Citation
 Zimmermann, SCDuvall, BTsukamoto, T Recent Progress in the Discovery of Allosteric Inhibitors of Kidney-Type Glutaminase. J Med Chem 62:46-59 (2019)  
Target
Name:
Glutaminase kidney isoform, mitochondrial
Synonyms:
GLS GLSK_HUMAN K-glutaminase L-glutamine amidohydrolase
Type:
Protein
Mol. Mass.:
73471.89
Organism:
Homo sapiens (Human)
Description:
O94925
Residue:
669
  
Inhibitor
Name:
BDBM404693
Synonyms:
N-(pyridin-2-ylmethyl)-5-[4-(6- {2-[3-(trifluoromethoxy)phenyl] acetamido}pyridazin-3-yl)butyl]- 1,3,4-thiadiazole-2-carboxamide US11370786, Example 32
Type:
Small organic molecule
Emp. Form.:
C26H24F3N7O3S
Mol. Mass.:
571.574
SMILES:
FC(F)(F)Oc1cccc(CC(=O)Nc2ccc(CCCCc3nnc(s3)C(=O)NCc3ccccn3)nn2)c1
: