Target
Glutaminase kidney isoform, mitochondrial
Ligand
BDBM108590
Substrate
Meas. Tech.
ChEMBL_1809965 (CHEMBL4309425)
IC50
130±n/a nM
Citation
 Zimmermann, SCDuvall, BTsukamoto, T Recent Progress in the Discovery of Allosteric Inhibitors of Kidney-Type Glutaminase. J Med Chem 62:46-59 (2019)  
Target
Name:
Glutaminase kidney isoform, mitochondrial
Synonyms:
GLS GLSK_HUMAN K-glutaminase L-glutamine amidohydrolase
Type:
Protein
Mol. Mass.:
73471.89
Organism:
Homo sapiens (Human)
Description:
O94925
Residue:
669
  
Inhibitor
Name:
BDBM108590
Synonyms:
US8604016, 163 | US9938267, Cmpd ID 163
Type:
Small organic molecule
Emp. Form.:
C26H28N6O4S2
Mol. Mass.:
552.668
SMILES:
COc1ccc(CC(=O)Nc2nnc(CCCCc3nnc(NC(=O)Cc4ccc(OC)cc4)s3)s2)cc1
: