Target
Cathepsin B
Ligand
BDBM50053799
Substrate
Meas. Tech.
ChEMBL_47385 (CHEMBL659000)
Ki
300±n/a nM
Citation
 Li, ZOrtega-Vilain, ACPatil, GSChu, DLForeman, JEEveleth, DDPowers, JC Novel peptidyl alpha-keto amide inhibitors of calpains and other cysteine proteases. J Med Chem 39:4089-98 (1996)  
Target
Name:
Cathepsin B
Synonyms:
BCSB CTSB Cathepsin B1
Type:
Enzyme
Mol. Mass.:
36657.87
Organism:
Bos taurus (bovine)
Description:
Bovine spleen CB was purchased from Sigma Co. (USA).
Residue:
335
  
Inhibitor
Name:
BDBM50053799
Synonyms:
CHEMBL134092 | [1-(1-{2-Hydroxy-2-[3-(3-trifluoromethyl-phenoxy)-phenyl]-ethylaminooxalyl}-propylcarbamoyl)-3-methyl-butyl]-carbamic acid benzyl ester
Type:
Small organic molecule
Emp. Form.:
C34H38F3N3O7
Mol. Mass.:
657.6766
SMILES:
CCC(NC(=O)C(CC(C)C)NC(=O)OCc1ccccc1)C(=O)C(=O)NCC(O)c1cccc(Oc2cccc(c2)C(F)(F)F)c1
: