Target
Cathepsin B
Ligand
BDBM50053810
Substrate
Meas. Tech.
ChEMBL_47385 (CHEMBL659000)
Ki
880±n/a nM
Citation
 Li, ZOrtega-Vilain, ACPatil, GSChu, DLForeman, JEEveleth, DDPowers, JC Novel peptidyl alpha-keto amide inhibitors of calpains and other cysteine proteases. J Med Chem 39:4089-98 (1996)  
Target
Name:
Cathepsin B
Synonyms:
BCSB CTSB Cathepsin B1
Type:
Enzyme
Mol. Mass.:
36657.87
Organism:
Bos taurus (bovine)
Description:
Bovine spleen CB was purchased from Sigma Co. (USA).
Residue:
335
  
Inhibitor
Name:
BDBM50053810
Synonyms:
CHEMBL130722 | N-[1-(1-Ethylaminooxalyl-propylcarbamoyl)-3-methyl-butyl]-nicotinamide
Type:
Small organic molecule
Emp. Form.:
C19H28N4O4
Mol. Mass.:
376.45
SMILES:
CCNC(=O)C(=O)C(CC)NC(=O)C(CC(C)C)NC(=O)c1cccnc1
: