Target
Cathepsin B
Ligand
BDBM50053827
Substrate
Meas. Tech.
ChEMBL_47427 (CHEMBL662614)
Ki
350±n/a nM
Citation
 Li, ZOrtega-Vilain, ACPatil, GSChu, DLForeman, JEEveleth, DDPowers, JC Novel peptidyl alpha-keto amide inhibitors of calpains and other cysteine proteases. J Med Chem 39:4089-98 (1996)  
Target
Name:
Cathepsin B
Synonyms:
APP secretase CATB_HUMAN CTSB Cathepsin B light chain | Cathepsin B1
Type:
Enzyme
Mol. Mass.:
37819.69
Organism:
Homo sapiens (Human)
Description:
gi_63102437
Residue:
339
  
Inhibitor
Name:
BDBM50053827
Synonyms:
3-[4-Methyl-2-(2-naphthalen-1-yl-acetylamino)-pentanoylamino]-2-oxo-pentanoic acid ethylamide | CHEMBL130215
Type:
Small organic molecule
Emp. Form.:
C25H33N3O4
Mol. Mass.:
439.5472
SMILES:
CCNC(=O)C(=O)C(CC)NC(=O)C(CC(C)C)NC(=O)Cc1cccc2ccccc12
: