Target
Calpain-1 catalytic subunit
Ligand
BDBM50053854
Substrate
Meas. Tech.
ChEMBL_43668 (CHEMBL656201)
Ki
380±n/a nM
Citation
 Li, ZOrtega-Vilain, ACPatil, GSChu, DLForeman, JEEveleth, DDPowers, JC Novel peptidyl alpha-keto amide inhibitors of calpains and other cysteine proteases. J Med Chem 39:4089-98 (1996)  
Target
Name:
Calpain-1 catalytic subunit
Synonyms:
CAN1_HUMAN CAPN1 Calpain-1 (u-Calpain) Calpain1
Type:
Protein
Mol. Mass.:
81880.51
Organism:
Homo sapiens (Human)
Description:
Residue:
714
  
Inhibitor
Name:
BDBM50053854
Synonyms:
(1-{1-[2-(4-Hydroxy-phenyl)-ethylaminooxalyl]-propylcarbamoyl}-3-methyl-butyl)-carbamic acid benzyl ester | CHEMBL130753
Type:
Small organic molecule
Emp. Form.:
C27H35N3O6
Mol. Mass.:
497.5833
SMILES:
CCC(NC(=O)C(CC(C)C)NC(=O)OCc1ccccc1)C(=O)C(=O)NCCc1ccc(O)cc1
: