Target
Cathepsin B
Ligand
BDBM50053857
Substrate
Meas. Tech.
ChEMBL_47385 (CHEMBL659000)
Ki
210±n/a nM
Citation
 Li, ZOrtega-Vilain, ACPatil, GSChu, DLForeman, JEEveleth, DDPowers, JC Novel peptidyl alpha-keto amide inhibitors of calpains and other cysteine proteases. J Med Chem 39:4089-98 (1996)  
Target
Name:
Cathepsin B
Synonyms:
BCSB CTSB Cathepsin B1
Type:
Enzyme
Mol. Mass.:
36657.87
Organism:
Bos taurus (bovine)
Description:
Bovine spleen CB was purchased from Sigma Co. (USA).
Residue:
335
  
Inhibitor
Name:
BDBM50053857
Synonyms:
(1-{1-[2-Hydroxy-2-(4-phenoxy-phenyl)-ethylaminooxalyl]-propylcarbamoyl}-3-methyl-butyl)-carbamic acid benzyl ester | CHEMBL131002
Type:
Small organic molecule
Emp. Form.:
C33H39N3O7
Mol. Mass.:
589.6787
SMILES:
CCC(NC(=O)C(CC(C)C)NC(=O)OCc1ccccc1)C(=O)C(=O)NCC(O)c1ccc(Oc2ccccc2)cc1
: