Target
Cathepsin B
Ligand
BDBM50053836
Substrate
Meas. Tech.
ChEMBL_47385 (CHEMBL659000)
Ki
20000±n/a nM
Citation
 Li, ZOrtega-Vilain, ACPatil, GSChu, DLForeman, JEEveleth, DDPowers, JC Novel peptidyl alpha-keto amide inhibitors of calpains and other cysteine proteases. J Med Chem 39:4089-98 (1996)  
Target
Name:
Cathepsin B
Synonyms:
BCSB CTSB Cathepsin B1
Type:
Enzyme
Mol. Mass.:
36657.87
Organism:
Bos taurus (bovine)
Description:
Bovine spleen CB was purchased from Sigma Co. (USA).
Residue:
335
  
Inhibitor
Name:
BDBM50053836
Synonyms:
(1-{1-Benzyl-2-[2-(3,4-bis-benzyloxy-phenyl)-2-hydroxy-ethylcarbamoyl]-2-oxo-ethylcarbamoyl}-3-methyl-butyl)-carbamic acid benzyl ester | CHEMBL133806
Type:
Small organic molecule
Emp. Form.:
C46H49N3O8
Mol. Mass.:
771.8966
SMILES:
CC(C)CC(NC(=O)OCc1ccccc1)C(=O)NC(Cc1ccccc1)C(=O)C(=O)NCC(O)c1ccc(OCc2ccccc2)c(OCc2ccccc2)c1
: