Target
Voltage-dependent L-type calcium channel subunit alpha-1S
Ligand
BDBM50053880
Substrate
Meas. Tech.
ChEMBL_92776 (CHEMBL700076)
Ki
62±n/a nM
Citation
 Dhainaut, ARegnier, GTizot, APierre, ALeonce, SGuilbaud, NKraus-Berthier, LAtassi, G New purines and purine analogs as modulators of multidrug resistance. J Med Chem 39:4099-108 (1996)  
Target
Name:
Voltage-dependent L-type calcium channel subunit alpha-1S
Synonyms:
CAC1S_RAT Cacn1 Cacnl1a3 Cchl1a3 Voltage-gated L-type calcium channel Voltage-gated calcium channel subunit alpha Cav1.1
Type:
PROTEIN
Mol. Mass.:
210392.58
Organism:
Rattus norvegicus
Description:
ChEMBL_92777
Residue:
1850
  
Inhibitor
Name:
BDBM50053880
Synonyms:
Allyl-(9-allyl-6-{4-[(10,11-dihydro-5H-dibenzo[a,d]cyclohepten-5-ylmethyl)-amino]-piperidin-1-yl}-9H-purin-2-yl)-amine | CHEMBL130086
Type:
Small organic molecule
Emp. Form.:
C32H37N7
Mol. Mass.:
519.6831
SMILES:
C=CCNc1nc(N2CCC(CC2)NCC2c3ccccc3CCc3ccccc23)c2ncn(CC=C)c2n1
: