Target
Glutamate receptor ionotropic, NMDA 2C
Ligand
BDBM50054804
Substrate
Meas. Tech.
ChEMBL_141146 (CHEMBL749664)
IC50
2300±n/a nM
Citation
 Shuto, SOno, SHase, YUeno, YNoguchi, TYoshii, KMatsuda, A Synthesis and biological activity of conformationally restricted analogs of milnacipran: (1S,2R)-1-phenyl-2-[(S)-1-aminopropyl]-N,N-diethylcyclopropanecarboxami de, an efficient noncompetitive N-methyl-D-aspartic acid receptor antagonist. J Med Chem 39:4844-52 (1997)  
Target
Name:
Glutamate receptor ionotropic, NMDA 2C
Synonyms:
Glutamate NMDA receptor; Grin1/Grin2c Grin2c NMDE3_RAT
Type:
Protein
Mol. Mass.:
135305.94
Organism:
Rattus norvegicus (Rat)
Description:
Q00961
Residue:
1237
  
Inhibitor
Name:
BDBM50054804
Synonyms:
(1S,2R)-2-(1-Amino-ethyl)-1-phenyl-cyclopropanecarboxylic acid diethylamide | CHEMBL330958
Type:
Small organic molecule
Emp. Form.:
C16H24N2O
Mol. Mass.:
260.3746
SMILES:
CCN(CC)C(=O)[C@]1(C[C@H]1C(C)N)c1ccccc1
: