Target
Protein kinase C alpha type
Ligand
BDBM50054971
Substrate
Meas. Tech.
ChEMBL_160291 (CHEMBL769619)
Ki
18400±n/a nM
Citation
 Lee, JLewin, NEAcs, PBlumberg, PMMarquez, VE Conformationally constrained analogues of diacylglycerol. 13. Protein kinase C ligands based on templates derived from 2,3-dideoxy-L-erythro(threo)-hexono-1,4-lactone and 2-deoxyapiolactone. J Med Chem 39:4912-9 (1997)  
Target
Name:
Protein kinase C alpha type
Synonyms:
KPCA_HUMAN PKC alpha and beta-2 PKC-alpha PRKACA Protein Kinase C- alpha Protein kinase C alpha (PKCa) Protein kinase C alpha type (PRKCA) RAF proto-oncogene serine/threonine-protein kinase
Type:
Enzyme
Mol. Mass.:
76755.65
Organism:
Homo sapiens (Human)
Description:
The recombinant human PKC enzymes were produced using a baculovirus expression system in SF9 cells
Residue:
672
  
Inhibitor
Name:
BDBM50054971
Synonyms:
CHEMBL145502 | [(S)-3-(2-Hydroxy-ethyl)-5-oxo-tetrahydro-furan-3-yl]-acetic acid tetradecyl ester
Type:
Small organic molecule
Emp. Form.:
C22H40O5
Mol. Mass.:
384.55
SMILES:
CCCCCCCCCCCCCCOC(=O)C[C@@]1(CCO)COC(=O)C1
: