Target
Retinoic acid receptor beta
Ligand
BDBM50055113
Substrate
Meas. Tech.
ChEMBL_195817 (CHEMBL799666)
Kd
189±n/a nM
Citation
 Johnson, ATKlein, ESWang, LPino, MEChandraratna, RA Identification of retinoic acid receptor beta subtype specific agonists. J Med Chem 39:5027-30 (1997)  
Target
Name:
Retinoic acid receptor beta
Synonyms:
HAP NR1B2 RAR-beta RARB Retinoic acid receptor RXR-alpha/Retinoic acid receptor beta Retinoid receptor
Type:
PROTEIN
Mol. Mass.:
50498.70
Organism:
Homo sapiens (Human)
Description:
ChEMBL_1458015
Residue:
455
  
Inhibitor
Name:
BDBM50055113
Synonyms:
5,5-Dimethyl-8-thiophen-2-yl-5,6-dihydro-naphthalene-2-carboxylic acid 4-carboxy-phenyl ester | CHEMBL148327
Type:
Small organic molecule
Emp. Form.:
C24H20O4S
Mol. Mass.:
404.478
SMILES:
CC1(C)CC=C(c2cccs2)c2cc(ccc12)C(=O)Oc1ccc(cc1)C(O)=O
: