Target
Polyunsaturated fatty acid 5-lipoxygenase
Ligand
BDBM50055130
Substrate
Meas. Tech.
ChEMBL_4166 (CHEMBL619233)
IC50
8000±n/a nM
Citation
 Adams, JLGarigipati, RSSorenson, MSchmidt, SJBrian, WRNewton, JFTyrrell, KAGarver, EYodis, LAChabot-Fletcher, MTzimas, MWebb, EFBreton, JJGriswold, DE Bicyclic N-hydroxyurea inhibitors of 5-lipoxygenase: pharmacodynamic, pharmacokinetic, and in vitro metabolic studies characterizing N-hydroxy-N-(2,3-dihydro-6-(phenylmethoxy)-3-benzofuranyl)urea. J Med Chem 39:5035-46 (1997)  
Target
Name:
Polyunsaturated fatty acid 5-lipoxygenase
Synonyms:
Alox5 LOX5_RAT
Type:
PROTEIN
Mol. Mass.:
78082.31
Organism:
Rattus norvegicus
Description:
ChEMBL_1432947
Residue:
673
  
Inhibitor
Name:
BDBM50055130
Synonyms:
CHEMBL145933 | bicyclic N-hydroxy urea derivatives
Type:
Small organic molecule
Emp. Form.:
C13H12N2O3
Mol. Mass.:
244.246
SMILES:
NC(=O)N(O)C1COc2ccc3ccccc3c12
: