Target
Phospholipase A2, major isoenzyme
Ligand
BDBM50055287
Substrate
Meas. Tech.
ChEMBL_156353 (CHEMBL761683)
IC50
610±n/a nM
Citation
 Dillard, RDBach, NJDraheim, SEBerry, DRCarlson, DGChirgadze, NYClawson, DKHartley, LWJohnson, LMJones, NDMcKinney, ERMihelich, EDOlkowski, JLSchevitz, RWSmith, ACSnyder, DWSommers, CDWery, JP Indole inhibitors of human nonpancreatic secretory phospholipase A2. 2. Indole-3-acetamides with additional functionality. J Med Chem 39:5137-58 (1997)  
Target
Name:
Phospholipase A2, major isoenzyme
Synonyms:
Group IB phospholipase A2 PLA2G1B Phospholipase A2
Type:
Hydrolase; monomer or homodimer
Mol. Mass.:
16279.83
Organism:
Sus scrofa (pig)
Description:
Purchased from Sigma.
Residue:
146
  
Inhibitor
Name:
BDBM50055287
Synonyms:
4-(1-Benzyl-3-carbamoylmethyl-2-methyl-1H-indol-4-yloxy)-butyric acid | CHEMBL146572
Type:
Small organic molecule
Emp. Form.:
C22H24N2O4
Mol. Mass.:
380.437
SMILES:
Cc1c(CC(N)=O)c2c(OCCCC(O)=O)cccc2n1Cc1ccccc1
: