Target
Phospholipase A2, major isoenzyme
Ligand
BDBM50055366
Substrate
Meas. Tech.
ChEMBL_156351 (CHEMBL871971)
IC50
48±n/a nM
Citation
 Draheim, SEBach, NJDillard, RDBerry, DRCarlson, DGChirgadze, NYClawson, DKHartley, LWJohnson, LMJones, NDMcKinney, ERMihelich, EDOlkowski, JLSchevitz, RWSmith, ACSnyder, DWSommers, CDWery, JP Indole inhibitors of human nonpancreatic secretory phospholipase A2. 3. Indole-3-glyoxamides. J Med Chem 39:5159-75 (1997)  
Target
Name:
Phospholipase A2, major isoenzyme
Synonyms:
Group IB phospholipase A2 PLA2G1B Phospholipase A2
Type:
Hydrolase; monomer or homodimer
Mol. Mass.:
16279.83
Organism:
Sus scrofa (pig)
Description:
Purchased from Sigma.
Residue:
146
  
Inhibitor
Name:
BDBM50055366
Synonyms:
(3-Aminooxalyl-1-benzyl-2-ethyl-1H-indol-4-yloxy)-acetic acid 2-(3-(2-amino-2-oxoacetyl)-1-benzyl-2-ethyl-1H-indol-4-yloxy)acetic acid Varespladib sodium
Type:
Small organic molecule
Emp. Form.:
C21H20N2O5
Mol. Mass.:
380.3939
SMILES:
CCc1c(C(=O)C(N)=O)c2c(OCC(O)=O)cccc2n1Cc1ccccc1
: