Target
Gag-Pol polyprotein [489-587]
Ligand
BDBM154
Substrate
Meas. Tech.
ChEMBL_157575 (CHEMBL763326)
Ki
0.027±n/a nM
Citation
 Jadhav, PKAla, PWoerner, FJChang, CHGarber, SSAnton, EDBacheler, LT Cyclic urea amides: HIV-1 protease inhibitors with low nanomolar potency against both wild type and protease inhibitor resistant mutants of HIV. J Med Chem 40:181-91 (1997)  
Target
Name:
Gag-Pol polyprotein [489-587]
Synonyms:
Human immunodeficiency virus type 1 protease Pol polyprotein | gag-pol
Type:
Enzyme Subunit
Mol. Mass.:
10781.16
Organism:
Human immunodeficiency virus type 1
Description:
P04585[489-587]
Residue:
99
  
Inhibitor
Name:
BDBM154
Synonyms:
3-{[(4R,5S,6S,7R)-4,7-dibenzyl-5,6-dihydroxy-2-oxo-3-{[3-(1,3-thiazol-2-ylcarbamoyl)phenyl]methyl}-1,3-diazepan-1-yl]methyl}-N-(1,3-thiazol-2-yl)benzamide XV638
Type:
Emp. Form.:
C41H38N6O5S2
Mol. Mass.:
758.908
SMILES:
O[C@@H]1[C@@H](O)[C@@H](Cc2ccccc2)N(Cc2cccc(c2)C(=O)Nc2nccs2)C(=O)N(Cc2cccc(c2)C(=O)Nc2nccs2)[C@@H]1Cc1ccccc1
: