Target
Alpha-2C adrenergic receptor
Ligand
BDBM50055829
Substrate
Meas. Tech.
ChEMBL_33527 (CHEMBL648619)
Ki
340±n/a nM
Citation
 Munk, SAHarcourt, DAArasasingham, PNBurke, JAKharlamb, ABManlapaz, CAPadillo, EURoberts, DRunde, EWilliams, LWheeler, LAGarst, ME Synthesis and evaluation of 2-(arylamino)imidazoles as alpha 2-adrenergic agonists. J Med Chem 40:18-23 (1997)  
Target
Name:
Alpha-2C adrenergic receptor
Synonyms:
ADA2C_HUMAN ADRA2L2 Adrenergic alpha2C Adrenergic receptor alpha Alpha-2 adrenergic receptor subtype C4 Alpha-2C adrenoreceptor | adrenergic, alpha-2C-, receptor [Homo sapiens]
Type:
Enzyme
Mol. Mass.:
49552.32
Organism:
Homo sapiens (Human)
Description:
P18825
Residue:
462
  
Inhibitor
Name:
BDBM50055829
Synonyms:
(1H-Imidazol-2-yl)-(5-methyl-quinoxalin-6-yl)-amine | CHEMBL75491
Type:
Small organic molecule
Emp. Form.:
C12H11N5
Mol. Mass.:
225.2492
SMILES:
Cc1c(Nc2ncc[nH]2)ccc2nccnc12
: