Target
Alpha-2B adrenergic receptor
Ligand
BDBM50055835
Substrate
Meas. Tech.
ChEMBL_33375 (CHEMBL648737)
EC50
1100±n/a nM
Citation
 Munk, SAHarcourt, DAArasasingham, PNBurke, JAKharlamb, ABManlapaz, CAPadillo, EURoberts, DRunde, EWilliams, LWheeler, LAGarst, ME Synthesis and evaluation of 2-(arylamino)imidazoles as alpha 2-adrenergic agonists. J Med Chem 40:18-23 (1997)  
Target
Name:
Alpha-2B adrenergic receptor
Synonyms:
ADA2B_RAT Adrenergic receptor alpha Alpha-2B adrenergic receptor Alpha-2B adrenoreceptor | adrenergic Alpha2B
Type:
Enzyme Catalytic Domain
Mol. Mass.:
50379.83
Organism:
NEONATAL RAT
Description:
adrenergic Alpha2B ADRA2B NEONATAL RAT::P19328
Residue:
453
  
Inhibitor
Name:
BDBM50055835
Synonyms:
(4-tert-Butyl-3-methoxy-2,6-dimethyl-phenyl)-(1H-imidazol-2-yl)-amine | CHEMBL75257
Type:
Small organic molecule
Emp. Form.:
C16H23N3O
Mol. Mass.:
273.3733
SMILES:
COc1c(C)c(Nc2ncc[nH]2)c(C)cc1C(C)(C)C
: