Target
Potassium-transporting ATPase alpha chain 1/subunit beta
Ligand
BDBM50056041
Substrate
Meas. Tech.
ChEMBL_162726 (CHEMBL765030)
IC50
460±n/a nM
Citation
 Terauchi, HTanitame, ATada, KNakamura, KSeto, YNishikawa, Y Nicotinamide derivatives as a new class of gastric H+/K(+)-ATPase inhibitors. 1. Synthesis and structure-activity relationships of N-substituted 2-(benzhydryl- and benzylsulfinyl)nicotinamides. J Med Chem 40:313-21 (1997)  
Target
Name:
Potassium-transporting ATPase alpha chain 1/subunit beta
Synonyms:
Potassium-transporting ATPase | Potassium-transporting ATPase alpha chain 1/beta chain
Type:
Mol. Mass.:
Description:
ASSAY_ID of EBI is 71495
Components:
This complex has 2 components.
Component 1
Name:
Potassium-transporting ATPase alpha chain 1
Synonyms:
ATP4A Gastric H(+)/K(+) ATPase subunit alpha Potassium-transporting ATPase alpha chain 1 | Proton pump
Type:
PROTEIN
Mol. Mass.:
114109.05
Organism:
Homo sapiens (Human)
Description:
EBI_82
Residue:
1035
  
Component 2
Name:
Potassium-transporting ATPase subunit beta
Synonyms:
ATP4B Gastric H(+)/K(+) ATPase subunit beta Potassium-transporting ATPase subunit beta | Proton pump beta chain
Type:
PROTEIN
Mol. Mass.:
33369.83
Organism:
Homo sapiens (Human)
Description:
EBI_10719
Residue:
291
  
Inhibitor
Name:
BDBM50056041
Synonyms:
2-(2,4-Dimethoxy-6-methyl-phenylmethanesulfinyl)-N-pyridin-4-yl-nicotinamide | CHEMBL108536
Type:
Small organic molecule
Emp. Form.:
C21H21N3O4S
Mol. Mass.:
411.474
SMILES:
COc1cc(C)c(CS(=O)c2ncccc2C(=O)Nc2ccncc2)c(OC)c1
: