Target
Potassium-transporting ATPase alpha chain 1/subunit beta
Ligand
BDBM50056046
Substrate
Meas. Tech.
ChEMBL_76070 (CHEMBL880098)
IC50
220±n/a nM
Citation
 Terauchi, HTanitame, ATada, KNakamura, KSeto, YNishikawa, Y Nicotinamide derivatives as a new class of gastric H+/K(+)-ATPase inhibitors. 1. Synthesis and structure-activity relationships of N-substituted 2-(benzhydryl- and benzylsulfinyl)nicotinamides. J Med Chem 40:313-21 (1997)  
Target
Name:
Potassium-transporting ATPase alpha chain 1/subunit beta
Synonyms:
Potassium-transporting ATPase | Potassium-transporting ATPase alpha chain 1/beta chain
Type:
Mol. Mass.:
Description:
Components:
This complex has 0 components.
Component 1
Name:
Potassium-transporting ATPase subunit beta
Synonyms:
ATP4B Gastric H(+)/K(+) ATPase subunit beta Potassium-transporting ATPase beta chain Proton pump beta chain | gp60-90
Type:
Mol. Mass.:
33083.09
Organism:
Sus scrofa (Pig)
Description:
Residue:
290
  
Component 2
Name:
Potassium-transporting ATPase alpha chain 1
Synonyms:
ATP4A Gastric H(+)/K(+) ATPase subunit alpha Na/K-ATPase Potassium-transporting ATPase alpha chain 1 | Proton pump
Type:
Enzyme
Mol. Mass.:
114279.23
Organism:
Sus scrofa (Pig)
Description:
P19156
Residue:
1034
  
Inhibitor
Name:
BDBM50056046
Synonyms:
2-Pyridin-4-yl-isothiazolo[5,4-b]pyridin-3-one | CHEMBL323034
Type:
Small organic molecule
Emp. Form.:
C11H7N3OS
Mol. Mass.:
229.258
SMILES:
O=c1n(sc2ncccc12)-c1ccncc1
: