Target
Cholecystokinin receptor type A
Ligand
BDBM50056086
Substrate
Meas. Tech.
ChEMBL_50192 (CHEMBL663485)
IC50
1820±n/a nM
Citation
 Semple, GRyder, HRooker, DPBatt, ARKendrick, DASzelke, MOhta, MSatoh, MNishida, AAkuzawa, SMiyata, K (3R)-N-(1-(tert-butylcarbonylmethyl)-2,3-dihydro-2-oxo-5-(2-pyridyl)-1H-1,4-benzodiazepin-3-yl)-N'-(3-(methylamino)phenyl)urea (YF476): a potent and orally active gastrin/CCK-B antagonist. J Med Chem 40:331-41 (1997)  
Target
Name:
Cholecystokinin receptor type A
Synonyms:
CCKAR_RAT Cholecystokinin peripheral Cholecystokinin receptor type A
Type:
Enzyme Catalytic Domain
Mol. Mass.:
49676.37
Organism:
RAT
Description:
Cholecystokinin central 0 RAT::P30551
Residue:
444
  
Inhibitor
Name:
BDBM50056086
Synonyms:
1-(3-Amino-phenyl)-3-[(R)-1-(3,3-dimethyl-2-oxo-butyl)-2-oxo-5-pyridin-2-yl-2,3-dihydro-1H-benzo[e][1,4]diazepin-3-yl]-urea | CHEMBL115612
Type:
Small organic molecule
Emp. Form.:
C27H28N6O3
Mol. Mass.:
484.5496
SMILES:
CC(C)(C)C(=O)CN1c2ccccc2C(=N[C@@H](NC(=O)Nc2cccc(N)c2)C1=O)c1ccccn1
: