Target
Serine/threonine-protein kinase pim-2
Ligand
BDBM50505061
Substrate
Meas. Tech.
ChEMBL_1817340 (CHEMBL4317000)
Ki
0.200000±n/a nM
Citation
 Wang, XBlackaby, WAllen, VChan, GKYChang, JHChiang, PCDične, CDrummond, JDo, SFan, EHarstad, EBHodges, AHu, HJia, WKofie, WKolesnikov, ALyssikatos, JPLy, JMatteucci, MMoffat, JGMunugalavadla, VMurray, JNash, DNoland, CLDel Rosario, GRoss, LRouse, CSharpe, ASlaga, DSun, MTsui, VWallweber, HYu, SFEbens, AJ Optimization of Pan-Pim Kinase Activity and Oral Bioavailability Leading to Diaminopyrazole (GDC-0339) for the Treatment of Multiple Myeloma. J Med Chem 62:2140-2153 (2019)  
Target
Name:
Serine/threonine-protein kinase pim-2
Synonyms:
PIM2 Pim-2h Serine/threonine-protein kinase PIM | Serine/threonine-protein kinase pim-2 (PIM2)
Type:
Serine/threonine-protein kinase
Mol. Mass.:
34185.93
Organism:
Homo sapiens (Human)
Description:
Q9P1W9
Residue:
311
  
Inhibitor
Name:
BDBM50505061
Synonyms:
CHEMBL4453890
Type:
Small organic molecule
Emp. Form.:
C20H23F2N7O2S
Mol. Mass.:
463.504
SMILES:
Cn1ncc(NC(=O)c2nc(sc2N)-c2c(F)cccc2F)c1N1CC[C@@H](N)[C@@H](O)CC1
: