Target
Thermolysin
Ligand
BDBM50056255
Substrate
Meas. Tech.
ChEMBL_210397 (CHEMBL814127)
IC50
60000±n/a nM
Citation
 Ksander, GMde Jesus, RYuan, AGhai, RDMcMartin, CBohacek, R Meta-substituted benzofused macrocyclic lactams as zinc metalloprotease inhibitors. J Med Chem 40:506-14 (1997)  
Target
Name:
Thermolysin
Synonyms:
THER_BACTH | npr
Type:
PROTEIN
Mol. Mass.:
60097.54
Organism:
Bacillus thermoproteolyticus
Description:
ChEMBL_1468794
Residue:
548
  
Inhibitor
Name:
BDBM50056255
Synonyms:
(6R,9S)-9-Mercaptomethyl-8-oxo-5,6,7,8,9,10,11,12,13,14,15,16-dodecahydro-7-aza-benzocyclotetradecene-6-carboxylic acid | CHEMBL423574
Type:
Small organic molecule
Emp. Form.:
C19H27NO3S
Mol. Mass.:
349.488
SMILES:
OC(=O)[C@H]1Cc2ccccc2CCCCCCC[C@H](CS)C(=O)N1
: