Target
D(1A) dopamine receptor
Ligand
BDBM50056362
Substrate
Meas. Tech.
ChEMBL_58330 (CHEMBL671946)
IC50
600±n/a nM
Citation
 Modica, MSantagati, MRusso, FParotti, LDe Gioia, LSelvaggini, CSalmona, MMennini, T [[(Arylpiperazinyl)alkyl]thio]thieno[2,3-d]pyrimidinone derivatives as high-affinity, selective 5-HT1A receptor ligands. J Med Chem 40:574-85 (1997)  
Target
Name:
D(1A) dopamine receptor
Synonyms:
DOPAMINE D1 Dopamine D1 high Dopamine receptor Dopamine1-like Drd1a
Type:
Enzyme Catalytic Domain
Mol. Mass.:
49429.75
Organism:
RAT
Description:
P18901
Residue:
446
  
Inhibitor
Name:
BDBM50056362
Synonyms:
3-Amino-5,6-dimethyl-2-[3-(4-pyrimidin-2-yl-piperazin-1-yl)-propylsulfanyl]-3H-thieno[2,3-d]pyrimidin-4-one | CHEMBL12177
Type:
Small organic molecule
Emp. Form.:
C19H25N7OS2
Mol. Mass.:
431.578
SMILES:
Cc1sc2nc(SCCCN3CCN(CC3)c3ncccn3)n(N)c(=O)c2c1C
: