Target
5-hydroxytryptamine receptor 2C
Ligand
BDBM50056378
Substrate
Meas. Tech.
ChEMBL_2789 (CHEMBL617858)
IC50
600±n/a nM
Citation
 Modica, MSantagati, MRusso, FParotti, LDe Gioia, LSelvaggini, CSalmona, MMennini, T [[(Arylpiperazinyl)alkyl]thio]thieno[2,3-d]pyrimidinone derivatives as high-affinity, selective 5-HT1A receptor ligands. J Med Chem 40:574-85 (1997)  
Target
Name:
5-hydroxytryptamine receptor 2C
Synonyms:
5-HT-2C 5-HT2C-INI 5-HTR2C 5-hydroxytryptamine receptor 2C (5-HT-2C) 5HT-1C HTR1C Serotonin (5-HT3) receptor Serotonin Receptor 2C
Type:
G Protein-Coupled Receptor (GPCR)
Mol. Mass.:
51836.79
Organism:
Homo sapiens (Human)
Description:
P28335
Residue:
458
  
Inhibitor
Name:
BDBM50056378
Synonyms:
3-Amino-2-{3-[4-(2-methoxy-phenyl)-piperazin-1-yl]-propylsulfanyl}-5,6-dimethyl-3H-thieno[2,3-d]pyrimidin-4-one | CHEMBL12028
Type:
Small organic molecule
Emp. Form.:
C22H29N5O2S2
Mol. Mass.:
459.628
SMILES:
COc1ccccc1N1CCN(CCCSc2nc3sc(C)c(C)c3c(=O)n2N)CC1
: