Target
Glutamate receptor ionotropic, NMDA 1
Ligand
BDBM50056622
Substrate
Meas. Tech.
ChEMBL_140856 (CHEMBL752487)
IC50
780.0±n/a nM
Citation
 Cai, SXKher, SMZhou, ZLIlyin, VEspitia, SATran, MHawkinson, JEWoodward, RMWeber, EKeana, JF Structure-activity relationships of alkyl- and alkoxy-substituted 1,4-dihydroquinoxaline-2,3-diones: potent and systemically active antagonists for the glycine site of the NMDA receptor. J Med Chem 40:730-8 (1997)  
Target
Name:
Glutamate receptor ionotropic, NMDA 1
Synonyms:
Glutamate (NMDA) receptor subunit zeta 1 Glutamate-NMDA-Channel Glutamate-NMDA-Polyamine NMDA Nmdar1 | phencyclidine
Type:
Enzyme Catalytic Domain
Mol. Mass.:
105533.40
Organism:
RAT
Description:
P35439
Residue:
938
  
Inhibitor
Name:
BDBM50056622
Synonyms:
6-Chloro-7-methyl-1,4-dihydro-quinoxaline-2,3-dione | CHEMBL288384
Type:
Small organic molecule
Emp. Form.:
C9H7ClN2O2
Mol. Mass.:
210.617
SMILES:
Cc1cc2[nH]c(=O)c(=O)[nH]c2cc1Cl
: