Target
Nuclear receptor corepressor 1
Ligand
BDBM50121210
Substrate
Meas. Tech.
ChEMBL_1822323 (CHEMBL4322087)
IC50
240±n/a nM
Citation
 Wu, GZhao, TKang, DZhang, JSong, YNamasivayam, VKongsted, JPannecouque, CDe Clercq, EPoongavanam, VLiu, XZhan, P Overview of Recent Strategic Advances in Medicinal Chemistry. J Med Chem 62:9375-9414 (2019)  
Target
Name:
Nuclear receptor corepressor 1
Synonyms:
KIAA1047 N-CoR1 NCOR1_HUMAN
Type:
PROTEIN
Mol. Mass.:
270226.27
Organism:
Homo sapiens (Human)
Description:
ChEMBL_107910
Residue:
2440
  
Inhibitor
Name:
BDBM50121210
Synonyms:
CHEMBL3622374
Type:
Small organic molecule
Emp. Form.:
C21H19N5OS
Mol. Mass.:
389.473
SMILES:
Nc1ccccc1NC(=O)c1ccc(cc1)-c1cn(CCc2ccsc2)nn1
: