Target
Histone-lysine N-methyltransferase, H3 lysine-79 specific
Ligand
BDBM28453
Substrate
Meas. Tech.
ChEMBL_1822375 (CHEMBL4322139)
Ki
9000±n/a nM
Citation
 Egbert, MWhitty, AKeser?, GMVajda, S Why Some Targets Benefit from beyond Rule of Five Drugs. J Med Chem 62:10005-10025 (2019)  
Target
Name:
Histone-lysine N-methyltransferase, H3 lysine-79 specific
Synonyms:
2.1.1.43 DOT1-like protein (Dot1L) DOT1L_HUMAN Histone H3-K79 methyltransferase Histone Methyltransferase DOT1L KIAA1814 Lysine N-methyltransferase 4
Type:
Protein
Mol. Mass.:
184911.91
Organism:
Homo sapiens (Human)
Description:
Q8TEK3
Residue:
1537
  
Inhibitor
Name:
BDBM28453
Synonyms:
(2R,3R,4S,5R)-2-(6-amino-9H-purin-9-yl)-5-[(dimethylamino)methyl]oxolane-3,4-diol | AdoMet substrate analogue, 23b
Type:
Small organic molecule
Emp. Form.:
C12H18N6O3
Mol. Mass.:
294.3097
SMILES:
CN(C)C[C@H]1O[C@H]([C@H](O)[C@@H]1O)n1cnc2c(N)ncnc12
: