Target
Adenosine receptor A2a
Ligand
BDBM50505384
Substrate
Meas. Tech.
ChEMBL_1822663 (CHEMBL4322427)
Ki
0.170000±n/a nM
Citation
 Falsini, MCatarzi, DVarano, FCeni, CDal Ben, DMarucci, GBuccioni, MVolpini, RDi Cesare Mannelli, LLucarini, EGhelardini, CBartolucci, GMenicatti, MColotta, V Antioxidant-Conjugated 1,2,4-Triazolo[4,3- J Med Chem 62:8511-8531 (2019)  
Target
Name:
Adenosine receptor A2a
Synonyms:
A2A adenosine receptor (hA2A) ADENOSINE A2 ADORA2 Adenosine A2A receptor (A2AAR)
Type:
G Protein-Coupled Receptor (GPCR)
Mol. Mass.:
44716.46
Organism:
Homo sapiens (Human)
Description:
P29274
Residue:
412
  
Inhibitor
Name:
BDBM50505384
Synonyms:
CHEMBL4457393
Type:
Small organic molecule
Emp. Form.:
C20H19N5O2
Mol. Mass.:
361.3972
SMILES:
COc1c(C)cc(cc1C)-c1cn2c(nn(-c3ccccc3)c2=O)c(N)n1
: