Target
Integrase
Ligand
BDBM50056900
Substrate
Meas. Tech.
ChEMBL_90710 (CHEMBL702109)
IC50
>100000±n/a nM
Citation
 Zhao, HNeamati, NSunder, SHong, HWang, SMilne, GWPommier, YBurke, TR Hydrazide-containing inhibitors of HIV-1 integrase. J Med Chem 40:937-41 (1997)  
Target
Name:
Integrase
Synonyms:
Human immunodeficiency virus type 1 integrase
Type:
PROTEIN
Mol. Mass.:
32231.48
Organism:
Human immunodeficiency virus 1
Description:
ChEMBL_90865
Residue:
288
  
Inhibitor
Name:
BDBM50056900
Synonyms:
2-Carbamoylphenol 2-Hydroxybenzamide OHB o-Hydroxybenzamide
Type:
Small organic molecule
Emp. Form.:
C7H7NO2
Mol. Mass.:
137.136
SMILES:
NC(=O)c1ccccc1O
: