Target
Protein kinase C gamma type
Ligand
BDBM50057509
Substrate
Meas. Tech.
ChEMBL_161290 (CHEMBL772098)
Ki
40.7±n/a nM
Citation
 Kozikowski, APWang, SMa, DYao, JAhmad, SGlazer, RIBogi, KAcs, PModarres, SLewin, NEBlumberg, PM Modeling, chemistry, and biology of the benzolactam analogues of indolactam V (ILV). 2. Identification of the binding site of the benzolactams in the CRD2 activator-binding domain of PKCdelta and discovery of an ILV analogue of improved isozyme selectivity. J Med Chem 40:1316-26 (1997)  
Target
Name:
Protein kinase C gamma type
Synonyms:
KPCG_HUMAN PKC-gamma PRKCG Protein kinase C gamma type Protein kinase C, gamma
Type:
Enzyme
Mol. Mass.:
78458.05
Organism:
Homo sapiens (Human)
Description:
The recombinant human PKC enzymes were produced using a baculovirus expression system in SF9 cells
Residue:
697
  
Inhibitor
Name:
BDBM50057509
Synonyms:
(2S,5S)-8-Dec-1-ynyl-5-hydroxymethyl-2-isopropyl-1-methyl-1,4,5,6-tetrahydro-2H-benzo[e][1,4]diazocin-3-one CHEMBL6453
Type:
Small organic molecule
Emp. Form.:
C25H38N2O2
Mol. Mass.:
398.5814
SMILES:
CCCCCCCCC#Cc1ccc2N(C)[C@@H](C(C)C)C(=O)N[C@H](CO)Cc2c1
: