Target
Prostaglandin G/H synthase 1
Ligand
BDBM50029616
Substrate
Meas. Tech.
ChEMBL_158753 (CHEMBL772766)
IC50
>1000000±n/a nM
Citation
 Penning, TDTalley, JJBertenshaw, SRCarter, JSCollins, PWDocter, SGraneto, MJLee, LFMalecha, JWMiyashiro, JMRogers, RSRogier, DJYu, SSAndersonGD, naBurton, EGCogburn, JNGregory, SAKoboldt, CMPerkins, WESeibert, KVeenhuizen, AWZhang, YYIsakson, PC Synthesis and biological evaluation of the 1,5-diarylpyrazole class of cyclooxygenase-2 inhibitors: identification of 4-[5-(4-methylphenyl)-3-(trifluoromethyl)-1H-pyrazol-1-yl]benze nesulfonamide (SC-58635, celecoxib). J Med Chem 40:1347-65 (1997)  
Target
Name:
Prostaglandin G/H synthase 1
Synonyms:
COX-1 Cyclooxygenase Cyclooxygenase-1 (COX-1) PTGS1 | Prostaglandin G/H synthase (cyclooxygenase)
Type:
Enzyme
Mol. Mass.:
68692.62
Organism:
Homo sapiens (Human)
Description:
P23219
Residue:
599
  
Inhibitor
Name:
BDBM50029616
Synonyms:
5-(4-Fluoro-phenyl)-1-(4-methanesulfonyl-phenyl)-3-trifluoromethyl-1H-pyrazole CHEMBL274990 SC58125
Type:
Small organic molecule
Emp. Form.:
C17H12F4N2O2S
Mol. Mass.:
384.348
SMILES:
CS(=O)(=O)c1ccc(cc1)-n1nc(cc1-c1ccc(F)cc1)C(F)(F)F
: