Target
Aryl hydrocarbon receptor
Ligand
BDBM50028963
Substrate
Meas. Tech.
ChEMBL_1824675 (CHEMBL4324439)
EC50
8.4±n/a nM
Citation
 Dolciami, DBallarotto, MGargaro, MLópez-Cara, LCFallarino, FMacchiarulo, A Targeting Aryl hydrocarbon receptor for next-generation immunotherapies: Selective modulators (SAhRMs) versus rapidly metabolized ligands (RMAhRLs). Eur J Med Chem 185:0 (2020)  
Target
Name:
Aryl hydrocarbon receptor
Synonyms:
AHR BHLHE76 aryl hydrocarbon receptor precursor
Type:
PROTEIN
Mol. Mass.:
96143.77
Organism:
Homo sapiens (Human)
Description:
ChEMBL_1503828
Residue:
848
  
Inhibitor
Name:
BDBM50028963
Synonyms:
3-Phenyl-1H-naphtho[2,1-b]pyran-1-one 3-phenyl-1H-benzo[f]chromen-1-one beta -naphthoflavone | beta-naphthoflavone
Type:
Small organic molecule
Emp. Form.:
C19H12O2
Mol. Mass.:
272.2974
SMILES:
O=c1cc(oc2ccc3ccccc3c12)-c1ccccc1
: