Target
Aryl hydrocarbon receptor
Ligand
BDBM50239186
Substrate
Meas. Tech.
ChEMBL_1824679 (CHEMBL4324443)
EC50
78000±n/a nM
Citation
 Dolciami, DBallarotto, MGargaro, MLópez-Cara, LCFallarino, FMacchiarulo, A Targeting Aryl hydrocarbon receptor for next-generation immunotherapies: Selective modulators (SAhRMs) versus rapidly metabolized ligands (RMAhRLs). Eur J Med Chem 185:0 (2020)  
Target
Name:
Aryl hydrocarbon receptor
Synonyms:
AHR_MOUSE Ahr | Aryl hydrocarbon receptor
Type:
Protein
Mol. Mass.:
95014.92
Organism:
Mus musculus (Mouse)
Description:
P30561
Residue:
848
  
Inhibitor
Name:
BDBM50239186
Synonyms:
1,1-Bis(3''-Indolyl)Methane 3,3-Diindolylmethane CHEBI:50182 | Diindolylmethane
Type:
Small organic molecule
Emp. Form.:
C17H14N2
Mol. Mass.:
246.3065
SMILES:
C(c1c[nH]c2ccccc12)c1c[nH]c2ccccc12
: