Target
Sigma non-opioid intracellular receptor 1
Ligand
BDBM50058020
Substrate
Meas. Tech.
ChEMBL_202073 (CHEMBL811505)
Ki
0.67±n/a nM
Citation
 Waterhouse, RNMardon, KGiles, KMCollier, TLO'Brien, JC Halogenated 4-(phenoxymethyl)piperidines as potential radiolabeled probes for sigma-1 receptors: in vivo evaluation of [123I]-1-(iodopropen-2-yl)-4-[(4-cyanophenoxy)methyl]pip eri dine. J Med Chem 40:1657-67 (1997)  
Target
Name:
Sigma non-opioid intracellular receptor 1
Synonyms:
Aging-associated gene 8 protein SGMR1_HUMAN SIGMAR1 SR31747-binding protein Sigma 1-type opioid receptor Sigma1R | hSigmaR1
Type:
Enzyme Catalytic Domain
Mol. Mass.:
25124.85
Organism:
Homo sapiens (Human)
Description:
Q99720
Residue:
223
  
Inhibitor
Name:
BDBM50058020
Synonyms:
4-[1-((E)-3-Iodo-allyl)-piperidin-4-ylmethoxy]-benzonitrile CHEMBL274585
Type:
Small organic molecule
Emp. Form.:
C16H19IN2O
Mol. Mass.:
382.2393
SMILES:
I\C=C\CN1CCC(COc2ccc(cc2)C#N)CC1
: